﻿Master_sort,Sample_ID,DayspostPICU,Patient_0no1yes,age_months,Primary_Organ_failure,Sepsis_nonsepsis,Resp_nonresp,Neuro_nonneuro,DaysfreePICU30d,ventilation__hours,DayspostPICU,Survival,"3a.Hydroxy.6,7.DiketoCholanic_Acid",Taurohyocholic_Acid,Glycoursodeoxycholic_Acid,3_Dehydrocholic_Acid,"3,12.Diketocholanic_Acid",Ursodeoxycholic_acid,12_Dehydrocholic_Acid,Glycochenodeoxycholic_Acid,3a.Hydroxy.12_Ketolithocholic_Acid,Isolithocholic_Acid,Chenodeoxycholic_Acid,"5ß.Cholanic_Acid.3ß,_12a.diol",3.Ketocholanic_Acid,Lithocholic_acid,Deoxycholic_Acid,Cholic_acid,"23.nor.5b.Cholanic_Acid.3a,_12a.diol",3a.Hydroxy.12_Ketolithocholic_Acid,Taurocholic_Acid,weight_kg,Sample_num,GHICI_num,Sample_name,group_patient,first_sample ,day_sample,DateRange,Sex_#,age_months,age_6m_group,age_year_group,primary_diagnosis,diagnosis_group1 ,diagnosis_group2,PICU_outcome,ventilation_hours,PICU_free_days,antibiotics,antibiotic_type,ENA_decode,seq_file,extraction_control,extraction_kit,Incertae_sedis,Bacteroides,Enterococcus,Faecalibacterium,Escherichia-Shigella,Ruminococcus,Prevotella_9,Bifidobacterium,Parabacteroides,Streptococcus,Staphylococcus,Alistipes,Collinsella,Dialister,Corynebacterium,Lachnoclostridium,Ruminococcus torques group,Phascolarctobacterium,Klebsiella,Clostridium sensu stricto 1,Agathobacter,Sutterella,Clostridium sensu stricto 12,Catabacter,Barnesiella,Eubacterium hallii group,Peptoanaerobacter,Ligilactobacillus,Clostridioides,Cutibacterium,Erysipelatoclostridium,Coprococcus,Parasutterella,Lactobacillus,Actinomyces,Roseburia,Romboutsia,Eubacterium coprostanoligenes group,Holdemanella,Megamonas,Solobacterium,Veillonella,Fusicatenibacter,Blattabacterium,Bilophila,Odoribacter,Catenibacterium,Pseudobutyrivibrio,Haemophilus,Flavonifractor,3M1PL1-52 termite group,Bacillus,Intestinibacter,Terrisporobacter,Hungatella,Turicibacter,Dorea,Ruminiclostridium,Prevotella,Paraprevotella,Granulicatella,Blautia,Oribacterium,Lacticaseibacillus,Tyzzerella,Subdoligranulum,Butyricicoccus,Akkermansia,Limosilactobacillus,Ruminococcus gnavus group,Scardovia,Oscillibacter,Parvimonas,Anaerostipes,Curvibacter,Peptostreptococcus,Eubacterium siraeum group,Eubacterium oxidoreducens group,Eubacterium,Abiotrophia,Lactiplantibacillus,Eubacterium nodatum group,Rothia,Faecalitalea,Anaerovorax,Butyricimonas,Gordonibacter,Brevundimonas,Eubacterium ventriosum group,Senegalimassilia,Coprobacillus,Maribacter,Brachyspira,Olsenella,Lactococcus,Eubacterium eligens group,Eisenbergiella,Anaerosinus,Adlercreutzia,Atopobium,Thermoclostridium,Pseudoflavonifractor,Gemella,Lachnospira,Microbacterium,Coprobacter,Fusobacterium,Holdemania,Hungateiclostridium,Stomatobaculum,Anaerococcus,Dielma,Anaerotruncus,Anaerovibrio,Finegoldia,Saccharimonadales,Sarcina,Clostridium methylpentosum group,Butyrivibrio,Weissella,Geobacillus,Eubacterium xylanophilum group,Faecalicoccus,Caldibacillus,Desulfovibrio,Anaerostignum,Christensenella,Pseudoramibacter,Desulfonatronospira,Anaerocolumna,Clostridium innocuum group,Enhydrobacter,Hydrogenophilus,Enorma,Allisonella,Clostridium sensu stricto 13,Acidaminococcus,Megasphaera,Pantoea,Eubacterium brachy group,Aggregatibacter,Campylobacter,Ramlibacter,Clostridium sensu stricto 18,Intestinimonas,Lachnoanaerobaculum,Desulfallas-Sporotomaculum,Howardella,Peptoniphilus,Ottowia,Porphyromonas,Paraeggerthella,Byssovorax,Pseudoxanthomonas,Pseudopropionibacterium,Enterorhabdus,Dolosigranulum,Proteus,Cupriavidus
1,P005,8,1,101,Trauma/surgical,,,,,,8,Alive,,,,,,,,,,,,,,,,,,,,18,005_day_8,005,101,patient,first_sample ,8,d5-10,F,101,36m_191m,36m_191m,post_endo,Surgery,non_lung,Alive,192,0,antibiotics_yes,cef_aug,ST_101_K2_NE11_1,ERR1604573,ERR1604578,2,88,405,8,13,138,44,1,0,4,98,4,17,0,0,8157,175,89,504,0,0,7,0,0,2309,0,463,1,9,1,2,11,0,0,0,1,1,0,0,0,0,9,0,3,0,9,1,1,0,0,0,0,42,0,0,5,0,32,0,0,0,0,0,3,0,2,0,0,0,48,10,2,0,0,0,1,0,0,1,10,1,0,0,1,6,0,0,1,0,0,0,0,0,0,0,0,0,1,0,0,0,0,0,1,0,0,0,0,0,0,0,0,0,0,0,2,5,0,0,0,0,0,0,0,0,0,0,0,0,0,0,0,0,0,0,0,0,0,0,0,0,0,0,0,0,0,0,0,0,0,0,0,0,0,0,1,0,0,0,0
2,P010,2,1,49,Sepsis,,,,,,,Alive,,,,,,,,,,,,,,,,,,,,15.2,010_day_2,010,7,patient,first_sample ,2,d1-4,M,49,36m_191m,36m_191m,flu,Infection,lung,Alive,96,25,antibiotics_yes,cet,ST_7_K1_NE8_1,ERR1604515,ERR1604570,1,52,275,0,40,0,122,23,263,4,83,25,7,72,57,0,5,28,4,0,5,3,3,8393,811,9,30,0,0,4,36,1,23,0,1,27,0,2,0,0,0,2,312,1,0,1,13,0,0,0,2,0,8,0,1,5,1,1,0,0,0,100,0,6,1,0,5,1,4,0,0,0,0,2,0,74,439,0,0,0,42,0,46,90,0,1,0,2,10,0,0,0,0,0,0,0,0,1,0,3,56,1,0,16,0,5,0,0,2,0,0,0,0,0,0,0,2,0,0,0,0,0,0,0,0,0,0,0,0,0,0,0,0,0,0,0,0,0,15,0,0,0,0,0,0,0,0,0,0,0,0,0,0,3,0,0,0,0,0,0
3,P012,3,1,136,Respiratory,,,,,,,Alive,,,,,,,,,,,,,,,,,,,,,012_day_3,012,5,patient,first_sample ,3,d1-4,F,136,36m_191m,36m_191m,asthma,Respiratory,lung,Alive,96,25,antibiotics_yes,unknown,ST_5_K1_NE8_1,ERR1604513,ERR1604570,1,17,9959,18,251,42,151,38,0,52,34,0,136,0,0,0,270,0,244,0,114,36,131,1,1,0,11,0,8,8,0,89,25,2,0,0,0,34,15,0,0,235,4,23,0,3,40,0,0,1,29,28,0,39,16,181,28,16,0,4,0,0,0,1,0,0,16,0,0,0,1,0,5,0,0,0,0,2,0,0,0,0,1,0,0,2,0,0,0,0,0,5,0,0,0,0,1,34,0,0,0,0,3,0,0,0,0,0,0,0,0,0,23,0,0,0,0,0,0,0,0,0,0,0,0,0,0,0,0,0,0,0,0,0,0,0,0,0,0,0,0,0,0,0,0,0,0,0,0,0,0,0,0,0,0,0,0,0,0,0
4,P013,1,1,15,Sepsis,,,,,,,Alive,,,,,,,,,,,,,,,,,,,,,013_day_1,013,14,patient,first_sample ,1,d1-4,M,15,12m_36m,12m_24m,croup,resp_infection,lung,Alive,48,28,antibiotics_yes,unknown,ST_14_K1_NE8_1,ERR1604522,ERR1604570,1,2194,1467,84,551,241,895,13,1009,4,89,1,8,0,192,0,518,562,0,0,83,377,0,0,0,0,0,0,0,189,0,174,196,46,0,30,2,108,0,0,2,74,6,111,0,0,0,0,4,0,1,0,0,0,3,18,0,408,0,6,0,13,29,0,0,523,0,1128,424,0,243,0,0,0,7,0,3,0,0,0,18,0,0,11,0,137,0,0,0,0,0,43,0,0,0,1,0,0,0,33,1,0,0,6,0,0,0,0,0,0,0,0,4,0,0,3,2,0,0,0,0,0,0,0,0,0,0,0,0,0,0,5,0,0,0,0,0,0,1,0,0,0,0,0,0,0,0,0,0,0,0,0,0,0,0,0,0,0,0,0
5,P014,1,1,181,Respiratory,,,,,,,Died,,,,,,,,,,,,,,,,,,,,,014_day_1,014,3,patient,first_sample ,1,d1-4,F,181,36m_191m,36m_191m,resp_fail,Respiratory,lung,died,432,0,antibiotics_yes,unknown,ST_3_K1_NE8_1,ERR1604511,ERR1604570,1,366,162,5,38,327,32,13,5210,49,405,24,680,0,72,11,3,18,0,1,6,11,1,7,888,0,435,0,534,1,0,36,0,0,29,1,2,0,0,0,0,1,3,25,0,35,25,0,0,2,3,7,0,0,0,4,1,21,0,0,0,0,0,0,188,51,0,0,0,908,1,0,0,0,0,1,0,0,0,7,0,0,12,0,50,6,0,3,0,0,0,0,0,0,0,7,0,0,0,1,1,6,0,0,0,0,2,0,0,0,0,0,36,2,0,0,0,0,3,0,0,0,0,0,13,0,0,43,0,0,0,0,0,0,0,0,0,0,0,0,0,0,0,0,0,0,0,1,0,0,0,0,0,0,0,0,3,0,0,0
6,P015,8,1,51.6,Respiratory,1,1,0,19,504,9,Alive,3.21E+05,5.39E+05,2.89E+05,2.20E+06,7.43E+07,3.73E+06,5.19E+06,2.01E+06,3.08E+07,1.55E+06,4.05E+06,1.63E+05,8.88E+06,3.97E+06,2.18E+07,1.59E+06,2.85E+04,1.14E+05,1.93E+06,15,015_day_8,015,9,patient,first_sample ,8,d5-10,F,51,36m_191m,36m_191m,pneumo,resp_infection,lung,Alive,216,19,antibiotics_yes,pen_flu_clin_pip_taz,ST_9_K1_NE8_1,ERR1604517,ERR1604570,1,65,2854,183,5,2952,60,0,66,414,2076,0,635,136,0,16,131,55,51,0,55,0,13,10,23,0,105,0,11,0,0,365,1,48,0,9,0,37,0,0,0,371,0,0,63,420,249,0,10,0,3,0,1,100,9,1,10,4,0,0,0,13,1,0,0,12,0,3,90,0,0,0,0,36,0,2,2,2,0,157,0,0,11,0,38,5,4,1,1,0,0,0,0,172,0,0,0,0,0,0,1,39,1,3,0,0,18,0,0,6,0,0,0,0,0,0,0,0,1,0,0,19,0,0,45,0,0,9,0,3,0,2,0,0,0,0,0,0,1,0,0,0,0,0,0,0,0,10,0,0,0,0,0,0,0,0,4,0,0,0
7,P016,2,1,17,Sepsis,1,0,0,,,,Alive,,,,,,,,,,,,,,,,,,,,10.7,016_day_2,016,8,patient,first_sample ,2,d1-4,M,17,12m_36m,12m_24m,chick_pox,Infection,non_lung,Alive,48,27,antibiotics_yes,cet_met_flu_clin_van_chl,ST_8_K1_NE8_1,ERR1604516,ERR1604570,1,37,253,6923,1,3492,21,2,199,40,205,3,6,16,307,21,17,0,0,0,101,0,9,0,2,0,19,0,0,0,4,31,11,0,0,0,1,5,0,0,0,1,0,0,0,30,6,0,0,0,1,0,0,0,0,0,7,0,0,90,0,25,1,0,0,0,0,0,0,0,5,0,0,0,0,36,30,0,0,0,172,0,0,1,0,4,0,4,2,0,0,0,0,0,0,3,0,1,0,0,1,0,0,18,0,1,100,0,0,0,0,0,0,0,0,4,0,0,0,0,0,0,0,0,0,0,0,0,0,0,0,0,0,0,0,0,0,0,0,0,0,0,0,0,0,0,0,0,0,0,0,0,0,0,0,0,0,24,0,0
8,P018,8,1,26.4,Sepsis,1,0,0,16,552,9,Alive,,,,,,,,,,,,,,,,,,,,12,018_day_8,018,2,patient,first_sample ,8,d5-10,F,25,12m_36m,24m_36m,sepsis,Infection,non_lung,Alive,168,16,antibiotics_yes,cef_gent_clin_benz,ST_2_K1_NE8_1,ERR1604510,ERR1604570,1,197,198,925,81,123,413,0,1072,0,1165,3,0,11,172,0,61,6481,0,0,2,2,7,0,9,0,184,0,41,0,2,89,246,0,0,27,4,9,3,0,0,4,129,94,0,0,0,0,2,12,1,0,1,0,4,1,5,0,0,0,0,18,0,0,0,0,0,3,23,1,51,0,3,0,0,17,0,1,0,0,2,0,0,7,66,42,0,3,1,0,0,0,0,0,0,34,0,1,0,0,5,0,0,61,0,1,0,0,0,0,0,0,0,0,0,0,3,0,0,0,0,0,0,0,0,0,0,0,0,0,0,0,0,0,0,0,0,0,0,0,0,0,0,0,0,0,0,0,0,0,0,0,0,0,0,0,0,0,0,0
9,P021,3,1,13.2,Neurological,1,0,1,19,480,3,Alive,6.16E+05,3.47E+06,1.30E+05,2.81E+06,1.23E+06,7.93E+06,4.85E+07,7.09E+05,4.56E+06,2.18E+05,5.77E+06,2.00E+05,2.84E+05,7.87E+05,1.33E+08,9.24E+07,4.61E+03,1.17E+05,4.31E+06,8.8,021_day_3,021,72,patient,first_sample ,3,d1-4,F,12,6m_12m,0m_12m,men,Infection,non_lung,Alive,240,19,antibiotics_yes,cet_clar_gent,ST_72_K2_NE2_1,ERR1604592,ERR1604545,2,4,4889,35,533,29,574,0,3589,0,79,0,0,0,572,0,25,10,0,3,6,18,1187,0,3,0,381,0,0,0,0,98,1,0,0,0,0,9,41,0,0,36,0,0,0,0,0,0,0,1,160,0,0,0,3,0,0,0,0,2,0,3,3,0,0,24,0,0,0,0,28,0,0,0,0,0,0,0,0,4,0,0,0,0,2,0,0,1,0,0,0,2,0,0,0,0,0,20,0,0,0,0,0,1,0,0,0,0,0,0,0,0,0,0,0,0,0,0,0,0,0,0,0,0,0,0,0,0,0,0,0,0,0,0,0,0,0,0,4,0,0,0,0,0,0,0,0,0,0,0,0,0,0,0,0,0,0,0,0,0
10,P021,8,1,13.2,repeat_entry,1,0,1,19,480,8,repeat_entry,4.54E+04,8.87E+07,2.56E+06,9.57E+04,2.20E+05,1.02E+05,5.05E+05,3.01E+08,7.64E+04,1.15E+04,7.91E+05,5.17E+03,5.92E+04,4.82E+04,2.08E+05,6.90E+06,4.95E+01,1.37E+01,2.02E+08,8.8,,,,,,,,,,,,,,,,,,,,,,,,,,,,,,,,,,,,,,,,,,,,,,,,,,,,,,,,,,,,,,,,,,,,,,,,,,,,,,,,,,,,,,,,,,,,,,,,,,,,,,,,,,,,,,,,,,,,,,,,,,,,,,,,,,,,,,,,,,,,,,,,,,,,,,,,,,,,,,,,,,,,,,,,,,,,,,,,,,,,,,
11,P024,8,1,26.4,Respiratory,0,1,0,11,432,8,Alive,,,,,,,,,,,,,,,,,,,,15,024_day_8,024,103,patient,first_sample ,8,d5-10,M,26,12m_36m,24m_36m,resp_fail,Respiratory,lung,Alive,288,11,antibiotics_yes,azi_gent_cef_clar_coa,ST_103_K2_NE11_1,ERR1604575,ERR1604578,2,137,5,10444,0,166,54,0,23,0,0,19,0,1,0,1,458,0,432,0,2,0,0,0,0,0,0,0,0,189,0,103,0,0,0,0,0,0,0,0,0,22,0,0,0,0,0,0,0,0,0,0,0,0,0,236,0,0,0,0,0,0,0,0,0,0,0,0,0,0,0,0,0,0,0,1,0,0,0,455,0,0,0,0,0,0,0,0,0,0,0,0,0,0,0,0,0,9,0,0,0,0,0,0,0,0,0,0,0,0,0,0,0,0,0,4,0,0,0,0,0,0,0,0,0,0,0,0,0,0,0,16,0,0,0,0,0,0,0,0,0,0,0,0,0,0,0,0,0,0,0,0,0,0,0,0,0,0,0,0
12,P025,8,1,170.4,Trauma/surgical,1,1,0,0,0,8,Died,2.20E+05,2.78E+06,5.78E+04,1.69E+06,2.86E+06,6.18E+06,1.19E+07,6.53E+05,8.03E+06,4.51E+06,3.82E+06,4.01E+05,2.37E+06,2.96E+07,2.66E+08,1.09E+07,4.03E+04,1.44E+05,6.88E+06,37.5,,,,,,,,,,,,,,,,,,,,,,,,,,,,,,,,,,,,,,,,,,,,,,,,,,,,,,,,,,,,,,,,,,,,,,,,,,,,,,,,,,,,,,,,,,,,,,,,,,,,,,,,,,,,,,,,,,,,,,,,,,,,,,,,,,,,,,,,,,,,,,,,,,,,,,,,,,,,,,,,,,,,,,,,,,,,,,,,,,,,,,
13,P027,3,1,98.4,Respiratory,0,1,0,23,600,3,Alive,,,,,,,,,,,,,,,,,,,,32,027_day_2,027,120,patient,first_sample ,2,d1-4,M,97,36m_191m,36m_191m,resp_fail,Respiratory,lung,Alive,120,23,antibiotics_yes,van_cef_tob_cip,ST_120_K2_NE13_3,ERR1737432,ERR1737434,2,0,0,0,0,0,0,0,4625,0,6421,0,0,0,0,1,0,0,0,0,1,0,0,0,0,0,0,0,0,0,0,0,0,0,1564,0,0,0,0,0,0,0,0,0,0,0,0,0,0,0,0,0,0,0,0,0,0,0,0,0,0,0,0,0,17,0,0,0,0,0,0,0,0,0,0,3,0,0,0,0,0,157,0,1,0,0,0,0,0,0,0,0,0,0,0,0,0,0,0,0,0,0,0,0,0,0,0,0,0,0,0,0,0,0,0,0,0,0,0,0,0,0,0,0,0,0,0,0,0,0,0,0,0,0,0,0,0,0,0,0,0,0,0,0,0,0,0,0,0,0,0,0,0,0,0,0,0,0,0,0
14,P030,10,1,202.8,Respiratory,1,1,0,0,0,10,Died,3.11E+05,6.65E+05,1.29E+05,1.27E+06,2.88E+06,5.17E+06,2.06E+07,8.25E+05,1.23E+07,4.81E+05,3.17E+06,2.04E+05,6.88E+05,2.27E+06,1.14E+08,4.05E+07,3.16E+04,1.49E+05,1.60E+06,24,,,,,,,,,,,,,,,,,,,,,,,,,,,,,,,,,,,,,,,,,,,,,,,,,,,,,,,,,,,,,,,,,,,,,,,,,,,,,,,,,,,,,,,,,,,,,,,,,,,,,,,,,,,,,,,,,,,,,,,,,,,,,,,,,,,,,,,,,,,,,,,,,,,,,,,,,,,,,,,,,,,,,,,,,,,,,,,,,,,,,,
15,P034,4,1,19.66027397,Trauma/surgical,0,0,1,28,696,,Alive,2.08E+05,5.42E+05,1.09E+05,1.28E+06,1.70E+06,4.81E+06,7.08E+06,4.71E+05,1.06E+07,8.06E+04,3.60E+06,2.09E+05,1.45E+05,3.23E+05,9.56E+07,2.07E+07,3.79E+04,1.44E+05,2.52E+06,12,034_day_3,034,74,patient,first_sample ,3,d1-4,F,19,12m_36m,12m_24m,head_injury,Neuro,non_lung,Alive,24,28,antibiotics_yes,cef,ST_74_K2_NE2_1,ERR1604594,ERR1604545,2,139,3558,1,722,62,127,916,815,751,8,0,720,118,1554,0,58,106,0,1,9,13,257,0,6,0,32,0,1,1040,0,6,178,9,0,0,11,1,2,0,0,17,2,7,0,4,62,0,52,0,27,0,0,0,9,30,16,0,0,0,232,0,0,0,0,0,0,0,24,0,87,0,0,0,0,0,0,61,12,0,0,0,2,0,0,9,0,0,0,0,0,7,0,0,0,0,0,0,0,0,0,9,0,0,0,0,0,0,6,0,0,0,0,0,0,0,0,0,0,0,0,0,0,0,0,0,0,0,0,0,0,10,0,0,0,0,0,76,0,0,0,0,0,0,0,0,0,0,0,0,0,0,0,0,0,0,0,0,0,7
16,P038,3,1,132,Respiratory,1,1,0,0,507,3,Alive,,,,,,,,,,,,,,,,,,,,44,038_day_3,038a,100,patient,first_sample ,3,d1-4,M,131,36m_191m,36m_191m,resp_fail,Respiratory,lung,Alive,8,22,antibiotics_no,na,ST_100_K2_NE11_1,ERR1604572,ERR1604578,2,0,0,12,0,1,0,0,0,0,0,12827,0,0,0,0,0,0,0,0,0,0,0,0,0,0,0,0,0,0,1,0,0,0,0,9,0,0,0,0,0,2,0,0,0,0,0,0,0,0,0,0,0,0,0,0,0,0,0,0,0,0,0,0,0,0,0,0,0,0,0,0,0,0,0,0,0,0,0,0,0,0,0,0,0,0,0,0,0,0,0,0,0,0,0,0,0,0,0,0,2,0,0,0,0,0,0,0,0,0,0,0,0,0,0,0,0,0,0,0,0,0,0,0,0,0,0,0,0,0,0,0,0,0,0,0,0,0,0,0,0,0,0,0,0,0,0,0,0,0,0,0,0,0,0,0,0,0,0,0
17,P038,8,1,132,repeat_entry,1,1,0,0,507,8,Alive,,,,,,,,,,,,,,,,,,,,44,038_day_8,038b,105,patient,second_sample,8,d5-10,M,131,36m_191m,36m_191m,resp_fail,Respiratory,lung,Alive,8,22,antibiotics_no,na,ST_105_K2_NE11_1,ERR1604577,ERR1604578,2,0,17,12636,0,2,2,0,2,0,0,76,1,1,0,4,0,0,0,0,0,0,0,0,0,0,0,0,0,3,0,0,0,0,0,19,0,0,0,0,0,12,1,0,0,0,0,0,0,0,0,0,0,0,0,0,0,0,0,0,0,0,0,41,0,0,0,0,0,0,0,0,0,0,0,0,0,0,0,0,0,0,0,5,0,0,0,0,0,0,0,0,0,0,0,0,0,0,0,0,0,0,0,0,0,0,0,0,0,0,0,16,0,0,0,0,0,0,0,0,0,0,0,0,0,0,0,0,0,0,0,0,0,0,0,0,0,0,0,0,0,0,0,0,0,0,0,0,0,0,0,0,0,0,0,0,0,0,0,0
18,P053,7,1,76.8,Sepsis,1,0,0,28,689,,repeat_entry,2.44E+04,5.49E+05,5.79E+03,1.26E+05,1.98E+05,5.83E+05,1.49E+06,1.53E+05,5.81E+04,1.74E+03,1.12E+06,2.62E+03,5.88E+05,1.54E+04,5.68E+05,2.32E+06,0.00E+00,1.99E+01,9.16E+05,20,,,,,,,,,,,,,,,,,,,,,,,,,,,,,,,,,,,,,,,,,,,,,,,,,,,,,,,,,,,,,,,,,,,,,,,,,,,,,,,,,,,,,,,,,,,,,,,,,,,,,,,,,,,,,,,,,,,,,,,,,,,,,,,,,,,,,,,,,,,,,,,,,,,,,,,,,,,,,,,,,,,,,,,,,,,,,,,,,,,,,,
19,P054,7,1,28.8,Respiratory,0,1,0,23,627,,Alive,1.61E+05,9.33E+05,2.18E+05,1.62E+06,6.05E+05,1.01E+07,6.10E+06,1.26E+06,1.16E+06,4.44E+04,3.57E+07,6.20E+04,1.92E+05,6.98E+05,5.08E+07,5.73E+07,1.71E+04,1.35E+04,2.33E+06,13,,,,,,,,,,,,,,,,,,,,,,,,,,,,,,,,,,,,,,,,,,,,,,,,,,,,,,,,,,,,,,,,,,,,,,,,,,,,,,,,,,,,,,,,,,,,,,,,,,,,,,,,,,,,,,,,,,,,,,,,,,,,,,,,,,,,,,,,,,,,,,,,,,,,,,,,,,,,,,,,,,,,,,,,,,,,,,,,,,,,,,
20,P055,2,1,15.6,Sepsis,1,0,1,27,706,2,Alive,1.30E+06,1.00E+06,2.98E+05,1.02E+07,1.82E+07,8.26E+07,6.43E+07,1.72E+06,9.32E+05,4.08E+04,3.94E+07,2.77E+04,5.45E+05,2.10E+05,1.51E+06,1.58E+08,1.91E+03,2.60E+01,5.83E+06,10.9,055_day_2,055,22,patient,first_sample ,2,d1-4,M,15,12m_36m,12m_24m,men,Infection,non_lung,Alive,14,27,antibiotics_yes,cef,ST_22_K1_NE9_1,ERR1604530,ERR1604571,1,163,4025,0,15,565,895,865,8,112,658,0,1061,0,816,0,151,568,0,0,147,0,0,0,1,0,304,0,0,0,0,376,137,149,0,60,17,140,0,0,0,44,1,134,205,0,0,0,0,3,8,0,0,0,32,21,4,0,0,0,0,14,48,0,0,47,74,3,16,0,72,0,109,0,0,0,0,0,0,0,0,0,0,0,0,0,0,8,0,0,0,14,0,0,198,0,0,0,0,0,1,0,0,0,0,0,50,0,0,0,0,0,0,0,0,0,0,0,39,0,0,0,0,0,3,0,0,0,0,0,0,0,0,0,0,0,0,0,0,0,0,0,0,0,0,0,0,0,0,0,0,0,0,0,0,0,0,0,0,0
21,P056,3,1,42,Trauma/surgical,1,0,0,25,661,3,Alive,7.34E+05,1.12E+06,3.67E+05,1.39E+07,1.68E+06,2.25E+06,2.17E+07,1.38E+06,1.03E+06,5.79E+05,8.63E+06,1.31E+04,2.53E+06,7.93E+06,4.28E+06,2.44E+08,1.04E+01,1.43E+01,4.70E+06,14.2,,,,,,,,,,,,,,,,,,,,,,,,,,,,,,,,,,,,,,,,,,,,,,,,,,,,,,,,,,,,,,,,,,,,,,,,,,,,,,,,,,,,,,,,,,,,,,,,,,,,,,,,,,,,,,,,,,,,,,,,,,,,,,,,,,,,,,,,,,,,,,,,,,,,,,,,,,,,,,,,,,,,,,,,,,,,,,,,,,,,,,
22,P058,8,1,31.2,Neurological,0,0,1,21,674,,Alive,2.17E+05,3.38E+06,3.75E+05,1.85E+06,4.79E+05,1.50E+06,1.32E+07,2.60E+06,9.42E+05,4.12E+03,1.27E+07,1.45E+04,1.85E+05,3.38E+04,6.67E+06,2.00E+08,1.48E+03,2.49E+01,1.88E+07,14,058_day_8,058,17,patient,first_sample ,8,d5-10,M,31,12m_36m,12m_24m,adem,Neuro,non_lung,Alive,46,21,antibiotics_yes,cef,ST_17_K1_NE9_1,ERR1604525,ERR1604571,1,1,25,3,1,7,0,3,180,6,22,0,18,12,0,0,0,0,0,0,0,0,3,34,340,0,9,0,0,0,0,1,1,0,0,0,0,0,0,55,0,1,1,1,0,0,1,24,0,0,3,0,0,0,0,0,0,0,0,1,0,0,0,0,0,0,0,0,0,0,0,0,0,0,0,0,3,0,0,0,0,0,0,0,0,0,0,0,0,0,5,0,0,0,0,4,0,0,0,0,0,1,0,0,0,0,0,0,0,0,0,0,0,0,0,0,0,0,0,0,0,0,0,0,0,0,0,5,0,0,0,0,0,0,0,0,0,0,0,0,0,0,0,0,0,0,0,0,1,0,0,0,0,0,0,0,0,0,0,0
23,P062,2,1,21.6,Respiratory,0,1,0,24,661,2,Alive,1.68E+06,5.31E+06,1.71E+05,6.59E+06,1.11E+06,1.86E+07,2.51E+08,5.49E+05,1.13E+07,8.52E+04,7.41E+06,2.60E+05,4.79E+05,1.22E+06,2.89E+08,3.99E+08,7.54E+02,1.50E+05,1.49E+07,14,,,,,,,,,,,,,,,,,,,,,,,,,,,,,,,,,,,,,,,,,,,,,,,,,,,,,,,,,,,,,,,,,,,,,,,,,,,,,,,,,,,,,,,,,,,,,,,,,,,,,,,,,,,,,,,,,,,,,,,,,,,,,,,,,,,,,,,,,,,,,,,,,,,,,,,,,,,,,,,,,,,,,,,,,,,,,,,,,,,,,,
24,P066,5,1,192,Neurological,0,0,1,24,653,2,Alive,6.00E+05,6.47E+05,2.57E+05,1.90E+06,7.42E+06,4.00E+06,1.51E+07,7.91E+05,1.95E+07,1.17E+05,2.81E+06,1.28E+05,1.54E+05,4.76E+05,4.08E+07,5.68E+06,8.48E+04,1.50E+05,3.58E+06,41,066_day_5,066,42,patient,first_sample ,5,d5-10,F,191,36m_191m,36m_191m,seiz,Neuro,non_lung,Alive,67,24,antibiotics_yes,cef,ST_42_K1_NE5_1,ERR1604553,ERR1604541,1,44,4338,3,901,300,1836,361,81,1349,12,2,817,328,0,0,31,48,49,1,19,27,434,76,5,0,2,0,0,0,0,1,16,81,0,0,0,74,0,0,0,21,0,0,0,0,47,0,0,0,27,48,121,0,0,5,15,0,0,0,0,0,9,0,0,2,0,0,0,0,30,0,0,0,0,0,0,21,1,10,0,0,14,0,165,2,13,10,0,0,0,13,55,45,0,0,0,82,0,7,0,31,73,0,0,0,0,0,1,0,0,0,8,0,0,0,0,0,45,0,0,1,0,0,5,0,0,4,0,0,0,0,0,0,0,0,0,0,0,0,0,0,0,0,0,0,0,7,0,0,0,0,0,0,0,0,0,0,0,0
25,P068,9,1,15.6,Sepsis,1,0,0,17,524,8,Alive,,,,,,,,,,,,,,,,,,,,8.2,068_day_9,068,48,patient,first_sample ,9,d5-10,F,15,12m_36m,12m_24m,nec_fas,Infection,non_lung,Alive,196,17,antibiotics_yes,benz_clin_tax,ST_48_K1_NE4_1,ERR1604562,ERR1604509,1,18,6612,489,0,3762,4,0,58,890,636,0,0,4,0,0,1,1,0,0,46,0,0,0,0,0,0,0,0,0,0,137,0,0,0,1,0,9,0,0,0,1,0,0,0,0,0,0,0,0,1,0,0,0,2,0,4,0,0,0,0,0,1,0,0,0,0,0,0,0,1,0,0,0,0,0,0,0,0,0,0,30,0,0,0,1,0,0,0,0,0,0,0,0,0,2,0,0,0,0,0,0,0,0,0,0,0,0,0,0,0,0,0,0,0,0,0,0,0,0,0,0,0,0,0,0,0,0,0,0,0,0,0,0,0,0,0,0,0,0,0,0,0,0,0,0,0,0,0,0,0,0,0,0,0,0,0,0,0,0
26,P069,5,1,18,Sepsis,1,0,1,23,636,4,Alive,1.03E+06,7.07E+05,2.12E+05,8.08E+06,1.06E+07,4.36E+07,4.00E+07,1.09E+06,9.29E+07,1.86E+05,2.61E+07,5.48E+05,4.69E+05,2.39E+06,2.68E+08,1.16E+08,4.98E+04,3.16E+05,3.15E+06,12,069_day_5,069,47,patient,first_sample ,5,d5-10,F,18,12m_36m,12m_24m,men,Infection,non_lung,Alive,84,23,antibiotics_yes,cef,ST_47_K1_NE4_1,ERR1604561,ERR1604509,1,334,1273,3,41,16,1187,682,1449,266,107,1,182,2144,44,0,77,89,0,0,1144,3,29,7,23,284,134,0,8,2,0,60,97,0,1,26,7,411,0,592,60,5,0,47,0,9,85,6,1,0,43,9,92,286,67,4,116,2,0,2,38,1,80,0,0,2,0,2,2,0,2,0,16,1,2,0,0,1,1,0,1,0,0,0,0,25,1,88,0,0,309,25,0,0,0,0,0,0,0,0,0,5,3,0,0,0,0,0,0,0,0,0,0,0,0,0,0,0,0,0,0,0,0,0,0,0,0,8,0,0,0,1,0,0,0,0,0,0,0,0,0,0,0,0,0,0,0,0,0,0,0,0,0,0,0,0,1,0,0,0
27,P070,4,1,34.8,Respiratory,1,1,0,17,587,7,Alive,4.04E+05,3.37E+06,6.16E+04,6.56E+06,5.13E+05,1.88E+06,9.31E+07,9.23E+05,5.49E+05,2.61E+03,8.01E+07,1.13E+04,1.60E+05,8.31E+03,9.10E+06,8.80E+08,5.59E+01,3.25E+02,3.82E+06,18.9,070_day_4,070,49,patient,first_sample ,4,d1-4,M,35,12m_36m,12m_24m,resp_fail,resp_infection,lung,Alive,133,17,antibiotics_yes,coa_azi,ST_49_K1_NE4_1,ERR1604563,ERR1604509,1,24,4953,788,0,2,27,3,55,3386,1,2,664,1,0,1,601,2,540,0,2,0,0,0,0,0,1,1,0,107,0,35,1,0,0,0,0,0,0,0,0,8,0,0,0,0,0,0,0,0,7,41,77,0,0,0,0,0,0,17,0,0,0,0,0,0,0,0,0,0,0,0,0,0,0,1,0,0,0,10,0,0,2,0,0,0,0,0,0,0,0,1,0,0,0,0,0,2,0,0,0,0,0,0,0,0,0,0,0,0,0,0,0,0,0,0,0,0,0,0,0,0,0,0,0,0,0,0,0,112,0,3,0,0,0,0,0,0,0,0,0,0,0,0,0,0,0,0,0,0,0,0,0,0,0,0,0,0,0,0
28,P071,3,1,15.6,Respiratory,1,1,0,18,496,3,Alive,4.34E+04,1.76E+06,4.98E+04,4.53E+06,3.46E+05,3.63E+06,2.52E+06,1.14E+06,8.46E+05,9.03E+04,2.36E+08,1.23E+04,1.04E+06,6.95E+05,7.38E+07,7.59E+08,2.89E+03,0.00E+00,9.25E+06,12.34,,,,,,,,,,,,,,,,,,,,,,,,,,,,,,,,,,,,,,,,,,,,,,,,,,,,,,,,,,,,,,,,,,,,,,,,,,,,,,,,,,,,,,,,,,,,,,,,,,,,,,,,,,,,,,,,,,,,,,,,,,,,,,,,,,,,,,,,,,,,,,,,,,,,,,,,,,,,,,,,,,,,,,,,,,,,,,,,,,,,,,
29,P072,7,1,25.2,Respiratory,0,1,0,21,672,,Alive,1.02E+05,1.52E+06,1.70E+05,6.16E+05,5.94E+05,1.48E+06,2.57E+06,7.49E+05,1.30E+06,7.84E+04,4.90E+05,7.26E+04,6.88E+05,9.47E+05,2.93E+07,1.43E+06,1.78E+03,3.23E+04,5.06E+06,12.7,,,,,,,,,,,,,,,,,,,,,,,,,,,,,,,,,,,,,,,,,,,,,,,,,,,,,,,,,,,,,,,,,,,,,,,,,,,,,,,,,,,,,,,,,,,,,,,,,,,,,,,,,,,,,,,,,,,,,,,,,,,,,,,,,,,,,,,,,,,,,,,,,,,,,,,,,,,,,,,,,,,,,,,,,,,,,,,,,,,,,,
30,P073,2,1,172.8,Sepsis,1,0,0,15,630,2,Alive,2.62E+05,5.61E+05,6.78E+04,2.99E+06,6.46E+05,3.13E+05,2.09E+07,1.18E+05,2.50E+04,2.88E+03,3.19E+05,2.10E+03,2.23E+05,9.14E+03,1.44E+05,1.09E+07,0.00E+00,1.27E+01,1.19E+06,29.9,,,,,,,,,,,,,,,,,,,,,,,,,,,,,,,,,,,,,,,,,,,,,,,,,,,,,,,,,,,,,,,,,,,,,,,,,,,,,,,,,,,,,,,,,,,,,,,,,,,,,,,,,,,,,,,,,,,,,,,,,,,,,,,,,,,,,,,,,,,,,,,,,,,,,,,,,,,,,,,,,,,,,,,,,,,,,,,,,,,,,,
31,P073,7,1,172.8,repeat_entry,1,0,0,15,630,,repeat_entry,6.36E+02,5.15E+06,7.15E+04,2.35E+05,3.15E+04,1.21E+06,2.18E+05,3.39E+05,2.15E+04,7.49E+02,1.54E+07,1.50E+03,2.85E+05,3.34E+03,1.39E+06,6.92E+07,0.00E+00,7.61E-01,1.03E+07,29.9,,,,,,,,,,,,,,,,,,,,,,,,,,,,,,,,,,,,,,,,,,,,,,,,,,,,,,,,,,,,,,,,,,,,,,,,,,,,,,,,,,,,,,,,,,,,,,,,,,,,,,,,,,,,,,,,,,,,,,,,,,,,,,,,,,,,,,,,,,,,,,,,,,,,,,,,,,,,,,,,,,,,,,,,,,,,,,,,,,,,,,
32,P079,1,1,70,Neurological,0,0,1,,,,Alive,,,,,,,,,,,,,,,,,,,,,079_day_1,079,66,patient,first_sample ,1,d1-4,M,70,36m_191m,36m_191m,resp_fail,Neuro,non_lung,Alive,12,0,antibiotics_yes,cef_coa,ST_66_K1_NE3_1,ERR1604583,ERR1604587,1,58,325,0,30,693,244,2227,72,481,19,91,0,28,603,0,2,1,1,0,10,0,14,18,46,0,0,0,286,25,0,0,6,241,10,1,13,28,0,31,0,1,3,1,0,0,0,231,642,30,1,0,0,21,1,0,0,4,66,288,5,1,0,78,0,0,0,0,0,0,13,0,7,0,0,0,0,103,153,1,0,0,0,0,0,4,3,0,0,0,0,0,0,0,0,0,94,3,0,0,0,0,0,0,0,0,0,0,0,0,0,0,0,58,0,0,0,0,0,0,172,0,0,0,0,0,0,0,0,0,0,0,0,0,0,0,0,0,49,0,0,0,0,0,0,0,0,0,0,0,0,0,0,0,0,0,0,0,0,0
33,P080,2,1,132,Neurological,1,0,1,24,632,2,Alive,,,,,,,,,,,,,,,,,,,,40,080_day_3,080a,65,patient,second_sample,3,d1-4,F,132,36m_191m,36m_191m,seiz,Neuro,non_lung,Alive,88,24,antibiotics_yes,cef_clar,ST_65_K1_NE3_1,ERR1604582,ERR1604587,1,1167,4683,2,0,52,1196,1,1814,1059,36,1,798,178,0,0,265,4,0,0,1,44,0,0,9,0,3,0,4,2,0,8,14,173,0,0,0,3,0,0,0,5,0,0,0,49,0,0,0,0,31,0,87,12,0,11,2,1,0,0,0,0,14,0,0,1,0,1,22,0,5,0,26,0,0,0,0,9,0,0,1,0,230,0,0,22,0,2,0,0,0,0,0,0,0,0,0,0,0,0,0,0,39,0,0,0,0,0,0,8,0,0,0,0,0,0,0,0,3,0,0,0,0,0,0,0,0,5,0,0,0,0,0,0,0,0,0,0,0,0,0,0,0,0,0,0,0,0,0,0,0,0,0,0,0,0,0,0,0,0
34,P080,1,1,132,repeat_entry,1,0,1,24,632,1,Alive,,,,,,,,,,,,,,,,,,,,40,080_day_1,080b,69,patient,first_sample ,1,d1-4,F,132,36m_191m,36m_191m,seiz,Neuro,non_lung,Alive,88,24,antibiotics_yes,cef_clar,ST_69_K1_NE3_1,ERR1604589,ERR1604587,1,672,4486,3,1,29,1158,1,1545,891,25,0,793,979,4,0,316,12,1,0,0,250,2,0,3,1,15,0,0,3,0,4,35,313,0,0,1,1,11,0,0,4,0,0,0,46,1,0,0,0,77,2,85,0,0,6,3,6,0,0,0,0,11,0,0,4,0,2,14,0,10,0,25,0,0,0,0,9,0,0,0,0,98,0,0,14,1,1,0,0,0,0,0,0,0,0,1,32,0,0,0,0,14,0,0,0,0,0,0,6,0,0,0,0,0,0,0,0,4,0,0,1,0,0,0,0,0,1,0,0,0,0,0,0,0,0,0,0,0,0,0,0,0,0,0,0,0,0,0,0,0,0,0,0,0,0,0,0,0,0
35,P081,2,1,36,Sepsis,1,0,0,25,640,2,Alive,,,,,,,,,,,,,,,,,,,,14,081_day_2,081,68,patient,first_sample ,2,d1-4,F,35,12m_36m,24m_36m,chick_pox,Infection,non_lung,Alive,80,25,antibiotics_yes,clin_met,ST_68_K1_NE3_1,ERR1604585,ERR1604587,1,39,40,1216,131,5532,132,42,231,502,78,1,4,94,2,9,2,35,36,0,0,5,21,2,1,0,41,0,1,3044,5,47,10,10,0,6,1,1,0,0,0,0,13,17,0,8,0,0,3,0,1,0,1,3,0,0,1,2,0,14,0,9,4,0,0,9,0,4,3,0,2,0,0,0,3,1,1,3,4,0,5,0,0,6,0,0,2,1,0,0,0,0,0,0,0,0,1,0,0,6,0,0,0,8,3,0,0,0,2,0,0,0,0,3,0,0,0,0,0,0,1,0,0,0,0,0,0,0,0,0,0,0,0,0,0,0,0,0,0,0,0,0,0,0,0,0,0,0,6,0,0,0,0,0,0,0,0,4,0,0